Build results: mc.debian

Build results: mc.debian

[FAIL] 2fd7aa8d72729ccec6c611fb3586e9c4c7b5e067

Use type hashing instead of string hasing in tyenv.

	Set the stage for stricter env lookups.

FAIL: build: make


./configure --redo
    Building with:
make[1]: Entering directory '/home/ori/contbuilds/mc.debian/parse'
rm -f gram.h
yacc -d -ogram.c gram.y
[ -f ] && mv gram.h || [ -f gram.h ]
make[2]: Entering directory '/home/ori/contbuilds/mc.debian/util'
mkdir -p .deps && touch .deps/stamp
cc -c -Wall -Werror -Wno-unused-parameter -Wno-missing-field-initializers -Wno-sign-compare -Wno-char-subscripts -g -O0 -MMD -MP -MF .deps/alloc.d   alloc.c
cc -c -Wall -Werror -Wno-unused-parameter -Wno-missing-field-initializers -Wno-sign-compare -Wno-char-subscripts -g -O0 -MMD -MP -MF .deps/bitset.d   bitset.c
cc -c -Wall -Werror -Wno-unused-parameter -Wno-missing-field-initializers -Wno-sign-compare -Wno-char-subscripts -g -O0 -MMD -MP -MF .deps/htab.d   htab.c
cc -c -Wall -Werror -Wno-unused-parameter -Wno-missing-field-initializers -Wno-sign-compare -Wno-char-subscripts -g -O0 -MMD -MP -MF .deps/pack.d   pack.c
cc -c -Wall -Werror -Wno-unused-parameter -Wno-missing-field-initializers -Wno-sign-compare -Wno-char-subscripts -g -O0 -MMD -MP -MF .deps/util.d   util.c
ar -rcs libutil.a alloc.o bitset.o htab.o pack.o util.o 
make[2]: Leaving directory '/home/ori/contbuilds/mc.debian/util'
mkdir -p .deps && touch .deps/stamp
cc -c -Wall -Werror -Wno-unused-parameter -Wno-missing-field-initializers -Wno-sign-compare -Wno-char-subscripts -g -O0 -MMD -MP -MF .deps/dump.d -I../util/  dump.c
cc -c -Wall -Werror -Wno-unused-parameter -Wno-missing-field-initializers -Wno-sign-compare -Wno-char-subscripts -g -O0 -MMD -MP -MF .deps/err.d -I../util/  err.c
cc -c -Wall -Werror -Wno-unused-parameter -Wno-missing-field-initializers -Wno-sign-compare -Wno-char-subscripts -g -O0 -MMD -MP -MF .deps/export.d -I../util/  export.c
cc -c -Wall -Werror -Wno-unused-parameter -Wno-missing-field-initializers -Wno-sign-compare -Wno-char-subscripts -g -O0 -MMD -MP -MF .deps/fold.d -I../util/  fold.c
cc -c -Wall -Werror -Wno-unused-parameter -Wno-missing-field-initializers -Wno-sign-compare -Wno-char-subscripts -g -O0 -MMD -MP -MF .deps/gram.d -I../util/  gram.c
cc -c -Wall -Werror -Wno-unused-parameter -Wno-missing-field-initializers -Wno-sign-compare -Wno-char-subscripts -g -O0 -MMD -MP -MF .deps/infer.d -I../util/  infer.c
cc -c -Wall -Werror -Wno-unused-parameter -Wno-missing-field-initializers -Wno-sign-compare -Wno-char-subscripts -g -O0 -MMD -MP -MF .deps/names.d -I../util/  names.c
cc -c -Wall -Werror -Wno-unused-parameter -Wno-missing-field-initializers -Wno-sign-compare -Wno-char-subscripts -g -O0 -MMD -MP -MF .deps/node.d -I../util/  node.c
cc -c -Wall -Werror -Wno-unused-parameter -Wno-missing-field-initializers -Wno-sign-compare -Wno-char-subscripts -g -O0 -MMD -MP -MF .deps/specialize.d -I../util/  specialize.c
../mk/ recipe for target 'specialize.o' failed
make[1]: Leaving directory '/home/ori/contbuilds/mc.debian/parse'
mk/ recipe for target 'subdirs' failed


Makefile:14: No such file or directory
specialize.c: In function ‘specializedcl’:
specialize.c:601:13: error: unused variable ‘stabstkoff’ [-Werror=unused-variable]
  extern int stabstkoff;
cc1: all warnings being treated as errors
make[1]: *** [specialize.o] Error 1
make: *** [subdirs] Error 1

NO RUN: test: make check

NO RUN: clean: make clean